Reaction Details
TargetBile acid receptor
LigandBDBM50544013
Substrate/Competitorn/a
Meas. Tech.ChEMBL_1991215 (CHEMBL4624950)
EC50 0.800000±n/a nM
Citation Masuda, AGohda, KIguchi, YFujimori, KYamashita, YOda, KUne, MTeno, N N Bioorg Med Chem28:0 (2020) 
 
Bile acid receptor
Name:Bile acid receptor
Type:Nuclear Receptor
Mol. Mass.:55916.24
Organism:Homo sapiens (Human)
Description:Q96RI1
Residue:486
BDBM50544013
NameBDBM50544013
Synonyms:CHEMBL4638567
TypeSmall organic molecule
Emp. Form.C32H31Cl2N3O4
Mol. Mass.592.512
SMILESCCC(CC)n1c(nc2ccc(cc12)C(O)=O)-c1ccc(OCc2c(onc2-c2c(Cl)cccc2Cl)C(C)C)cc1