Reaction Details
TargetBile acid receptor
LigandBDBM50544020
Substrate/Competitorn/a
Meas. Tech.ChEMBL_1991215 (CHEMBL4624950)
EC50 0.520000±n/a nM
Citation Masuda, AGohda, KIguchi, YFujimori, KYamashita, YOda, KUne, MTeno, N N Bioorg Med Chem28:0 (2020) 
 
Bile acid receptor
Name:Bile acid receptor
Type:Nuclear Receptor
Mol. Mass.:55916.24
Organism:Homo sapiens (Human)
Description:Q96RI1
Residue:486
BDBM50544020
NameBDBM50544020
Synonyms:CHEMBL4638213
TypeSmall organic molecule
Emp. Form.C34H33Cl2N3O4
Mol. Mass.618.55
SMILESCC(C)c1onc(c1COc1ccc(cc1)-c1nc2ccc(cc2n1CC1CCCCC1)C(O)=O)-c1c(Cl)cccc1Cl