Reaction Details
TargetEndothelin-1 receptor
LigandBDBM50101250
Substrate/Competitorn/a
Meas. Tech.ChEBML_65627
IC50 68±n/a nM
Citation Kukkola, PJBilci, NAIkler, TSavage, PShetty, SSDelGrande, DJeng, AY Isoindolines: a new series of potent and selective endothelin-A receptor antagonists. Bioorg Med Chem Lett11:1737-40 (2001) Endothelin-1 receptor
Name:Endothelin-1 receptor
Type:Enzyme Catalytic Domain
Mol. Mass.:48736.88
Organism:Homo sapiens (Human)
Description:P25101
Residue:427
BDBM50101250
NameBDBM50101250
Synonyms:3-[2-((1S,3R)-3-Benzo[1,3]dioxol-5-yl-2-carboxymethyl-6-ethoxy-2,3-dihydro-1H-isoindol-1-yl)-5-methoxy-phenoxy]-2,2-dimethyl-propionic acid | CHEMBL296974
TypeSmall organic molecule
Emp. Form.C31H33NO9
Mol. Mass.563.595
SMILESCCOc1ccc2[C@H](N(CC(O)=O)[C@@H](c2c1)c1ccc(OC)cc1OCC(C)(C)C(O)=O)c1ccc2OCOc2c1