Reaction Details
TargetCalpain small subunit 1
LigandBDBM50101319
Substrate/Competitorn/a
Meas. Tech.ChEBML_43685
Ki 76000±n/a nM
Citation Donkor, IOZheng, XHan, JLacy, CMiller, DD Significance of hydrogen bonding at the S(1)' subsite of calpain I. Bioorg Med Chem Lett11:1753-5 (2001) Calpain small subunit 1
Name:Calpain small subunit 1
Type:PROTEIN
Mol. Mass.:28062.13
Organism:Sus scrofa
Description:ChEMBL_43862
Residue:266
BDBM50101319
NameBDBM50101319
Synonyms:CHEMBL49829 | [(S)-1-((S)-1-Benzyl-2-diethylcarbamoyl-2-oxo-ethylcarbamoyl)-3-methyl-butyl]-carbamic acid benzyl ester
TypeSmall organic molecule
Emp. Form.C28H37N3O5
Mol. Mass.495.6105
SMILESCCN(CC)C(=O)C(=O)[C@H](Cc1ccccc1)NC(=O)[C@H](CC(C)C)NC(=O)OCc1ccccc1