Reaction Details
TargetCalpain small subunit 1
LigandBDBM50101321
Substrate/Competitorn/a
Meas. Tech.ChEBML_43685
Ki 45±n/a nM
Citation Donkor, IOZheng, XHan, JLacy, CMiller, DD Significance of hydrogen bonding at the S(1)' subsite of calpain I. Bioorg Med Chem Lett11:1753-5 (2001) Calpain small subunit 1
Name:Calpain small subunit 1
Type:PROTEIN
Mol. Mass.:28062.13
Organism:Sus scrofa
Description:ChEMBL_43862
Residue:266
BDBM50101321
NameBDBM50101321
Synonyms:CHEMBL299750 | [(S)-1-((S)-1-Benzyl-2-benzyloxycarbamoyl-2-oxo-ethylcarbamoyl)-3-methyl-butyl]-carbamic acid benzyl ester
TypeSmall organic molecule
Emp. Form.C31H35N3O6
Mol. Mass.545.6261
SMILESCC(C)C[C@H](NC(=O)OCc1ccccc1)C(=O)N[C@@H](Cc1ccccc1)C(=O)C(=O)NOCc1ccccc1