Reaction Details
TargetStromelysin-1
LigandBDBM50101526
Substrate/Competitorn/a
Meas. Tech.ChEMBL_104874 (CHEMBL708551)
Ki 13.5±n/a nM
Citation Terp, GEJohansen, BNChristensen, ITJørgensen, FS A new concept for multidimensional selection of ligand conformations (MultiSelect) and multidimensional scoring (MultiScore) of protein-ligand binding affinities. J Med Chem44:2333-43 (2001) Stromelysin-1
Name:Stromelysin-1
Type:Enzyme
Mol. Mass.:53973.13
Organism:Homo sapiens (Human)
Description: P08254
Residue:477
BDBM50101526
NameBDBM50101526
Synonyms:(R)-N*1*-((S)-2-Cyclohexyl-1-phenethylcarbamoyl-ethyl)-2-[3-(4-fluoro-phenyl)-propyl]-N*4*-hydroxy-succinamide N*1*-(2-Cyclohexyl-1-phenethylcarbamoyl-ethyl)-2-[3-(4-fluoro-phenyl)-propyl]-N*4*-hydroxy-succinamide
TypeSmall organic molecule
Emp. Form.C30H40FN3O4
Mol. Mass.525.6547
SMILESONC(=O)C[C@@H](CCCc1ccc(F)cc1)C(=O)N[C@@H](CC1CCCCC1)C(=O)NCCc1ccccc1