Reaction Details
Target72 kDa type IV collagenase
LigandBDBM50101516
Substrate/Competitorn/a
Meas. Tech.ChEMBL_104539 (CHEMBL718926)
Ki 0.01±n/a nM
Citation Terp, GEJohansen, BNChristensen, ITJørgensen, FS A new concept for multidimensional selection of ligand conformations (MultiSelect) and multidimensional scoring (MultiScore) of protein-ligand binding affinities. J Med Chem44:2333-43 (2001) 72 kDa type IV collagenase
Name:72 kDa type IV collagenase
Type:Enzyme
Mol. Mass.:73870.36
Organism:Homo sapiens (Human)
Description: P08253
Residue:660
BDBM50101516
NameBDBM50101516
Synonyms:3-(3-{2-[5-(4-Chloro-phenyl)-2-hydroxycarbamoylmethyl-pentanoylamino]-3-cyclohexyl-propionylamino}-propionylamino)-propionic acid | CHEMBL76158
TypeSmall organic molecule
Emp. Form.C28H41ClN4O7
Mol. Mass.581.101
SMILESONC(=O)C[C@@H](CCCc1ccc(Cl)cc1)C(=O)N[C@@H](CC1CCCCC1)C(=O)NCCC(=O)NCCC(O)=O