Reaction Details
Target72 kDa type IV collagenase
LigandBDBM50101513
Substrate/Competitorn/a
Meas. Tech.ChEMBL_104539 (CHEMBL718926)
Ki 0.08±n/a nM
Citation Terp, GEJohansen, BNChristensen, ITJørgensen, FS A new concept for multidimensional selection of ligand conformations (MultiSelect) and multidimensional scoring (MultiScore) of protein-ligand binding affinities. J Med Chem44:2333-43 (2001) 72 kDa type IV collagenase
Name:72 kDa type IV collagenase
Type:Enzyme
Mol. Mass.:73870.36
Organism:Homo sapiens (Human)
Description: P08253
Residue:660
BDBM50101513
NameBDBM50101513
Synonyms:(R)-N*1*-((S)-2-Cyclohexyl-1-phenethylcarbamoyl-ethyl)-N*4*-hydroxy-2-(3-p-tolyl-propyl)-succinamide N*1*-(2-Cyclohexyl-1-phenethylcarbamoyl-ethyl)-N*4*-hydroxy-2-(3-p-tolyl-propyl)-succinamide
TypeSmall organic molecule
Emp. Form.C31H43N3O4
Mol. Mass.521.6908
SMILESCc1ccc(CCC[C@H](CC(=O)NO)C(=O)N[C@@H](CC2CCCCC2)C(=O)NCCc2ccccc2)cc1