Reaction Details
TargetCarnitine O-palmitoyltransferase 1, liver isoform
LigandBDBM50101596
Substrate/Competitorn/a
Meas. Tech.ChEMBL_46317 (CHEMBL663461)
IC50>300000±n/a nM
Citation Giannessi, FChiodi, PMarzi, MMinetti, PPessotto, PDe Angelis, FTassoni, EConti, RGiorgi, FMabilia, MDell'Uomo, NMuck, STinti, MOCarminati, PArduini, A Reversible carnitine palmitoyltransferase inhibitors with broad chemical diversity as potential antidiabetic agents. J Med Chem44:2383-6 (2001) Carnitine O-palmitoyltransferase 1, liver isoform
Name:Carnitine O-palmitoyltransferase 1, liver isoform
Type:PROTEIN
Mol. Mass.:88147.11
Organism:Rattus norvegicus
Description:ChEMBL_887445
Residue:773
BDBM50101596
NameBDBM50101596
Synonyms:1-(3-Carboxy-2-tetradecyloxycarbonyloxy-propyl)-1-azonia-bicyclo[2.2.2]octane | CHEMBL431780
TypeSmall organic molecule
Emp. Form.C26H47NO5
Mol. Mass.453.6551
(=O)OC(CC([O-])=O)C[N+]12CCC(CC1)CC2