Reaction Details
TargetAlpha-1D adrenergic receptor
LigandBDBM50101664
Substrate/Competitorn/a
Meas. Tech.ChEMBL_216134 (CHEMBL816954)
Ki 0.13±n/a nM
Citation Barlocco, DCignarella, GPiaz, VDGiovannoni, MPDe Benedetti, PGFanelli, FMontesano, FPoggesi, ELeonardi, A Phenylpiperazinylalkylamino substituted pyridazinones as potent alpha(1) adrenoceptor antagonists. J Med Chem44:2403-10 (2001) Alpha-1D adrenergic receptor
Name:Alpha-1D adrenergic receptor
Type:Enzyme Catalytic Domain
Mol. Mass.:60485.82
Organism:Homo sapiens (Human)
Description:adrenergic Alpha1D ADRA1D HUMAN::P25100
Residue:572
BDBM50101664
NameBDBM50101664
Synonyms:5-Acetyl-4-{2-[4-(2-methoxy-phenyl)-piperazin-1-yl]-ethylamino}-2-methyl-6-phenyl-2H-pyridazin-3-one | CHEMBL80641
TypeSmall organic molecule
Emp. Form.C26H31N5O3
Mol. Mass.461.556
SMILESCOc1ccccc1N1CCN(CCNc2c(C(C)=O)c(nn(C)c2=O)-c2ccccc2)CC1