Reaction Details
TargetIntegrin alpha-IIb/beta-3
LigandBDBM50101758
Substrate/Competitorn/a
Meas. Tech.ChEMBL_215975 (CHEMBL821004)
IC50>10000±n/a nM
Citation Peyman, AScheunemann, KWill, DWKnolle, JWehner, VBreipohl, GStilz, HUCarniato, DRuxer, JGourvest, JAuberval, MDoucet, BBaron, RGaillard, MGadek, TRBodary, S alpha(v)beta(3) Antagonists based on a central thiophene scaffold. Bioorg Med Chem Lett11:2011-5 (2001) Integrin alpha-IIb/beta-3
Name:Integrin alpha-IIb/beta-3
Synonyms:Glycoprotein IIb/IIIa
Type:n/a
Mol. Mass.:n/a
Description:ASSAY_ID of EBI is 30109
Components:This complex has 2 components.
Component 1
Name:Integrin beta-3
Type:Protein
Mol. Mass.:87038.91
Organism:Homo sapiens (Human)
Description:P05106
Residue:788
Component 2
Name:Integrin alpha-IIb
Synonyms:CD_antigen=CD41 GPIIb Glycoprotein IIb ITGA2B Integrin alpha-IIb heavy chain Integrin alpha-IIb light chain, form 2 Integrin alpha-V/beta-3 and alpha-IIb/beta 3 | Platelet membrane glycoprotein IIb
Type:Protein
Mol. Mass.:113354.85
Organism:Homo sapiens (Human)
Description:P08514
Residue:1039
BDBM50101758
NameBDBM50101758
Synonyms:3-Benzo[1,3]dioxol-5-yl-3-{[5-(2-guanidinocarbonyl-cyclopropyl)-thiophene-2-carbonyl]-amino}-propionic acid | CHEMBL64179
TypeSmall organic molecule
Emp. Form.C23H24N4O6S
Mol. Mass.484.525
SMILESOC(=O)CC(NC(=O)c1ccc(s1)C1CC1C(=O)NC1=NCCCN1)c1ccc2OCOc2c1