Reaction Details
TargetIntegrin alpha-V/beta-3
LigandBDBM50101768
Substrate/Competitorn/a
Meas. Tech.ChEMBL_214766 (CHEMBL816224)
IC50 2±n/a nM
Citation Peyman, AScheunemann, KWill, DWKnolle, JWehner, VBreipohl, GStilz, HUCarniato, DRuxer, JGourvest, JAuberval, MDoucet, BBaron, RGaillard, MGadek, TRBodary, S alpha(v)beta(3) Antagonists based on a central thiophene scaffold. Bioorg Med Chem Lett11:2011-5 (2001) Integrin alpha-V/beta-3
Name:Integrin alpha-V/beta-3
Type:Enzyme
Mol. Mass.:n/a
Description:n/a
Components:This complex has 2 components.
Component 1
Name:Integrin alpha-V
Synonyms:ITAV_HUMAN Integrin alpha-V/alpha-5 VNRA Vitronectin receptor | Vitronectin receptor subunit alpha
Type:PROTEIN
Mol. Mass.:116024.92
Organism:Homo sapiens (Human)
Description:ChEMBL_582336
Residue:1048
Component 2
Name:Integrin beta-3
Synonyms:CD_antigen=CD61 GPIIIa ITGB3 Platelet membrane glycoprotein IIIa
Type:Protein
Mol. Mass.:87038.91
Organism:Homo sapiens (Human)
Description:P05106
Residue:788
BDBM50101768
NameBDBM50101768
Synonyms:(S)-3-({5-[2-(1,4,5,6-Tetrahydro-pyrimidin-2-ylcarbamoyl)-ethyl]-thiophene-2-carbonyl}-amino)-2-(4-trifluoromethyl-benzenesulfonylamino)-propionic acid | CHEMBL63943
TypeSmall organic molecule
Emp. Form.C22H24F3N5O6S2
Mol. Mass.575.581
SMILESOC(=O)[C@H](CNC(=O)c1ccc(CCC(=O)NC2=NCCCN2)s1)NS(=O)(=O)c1ccc(cc1)C(F)(F)F