Reaction Details
TargetAdenosine receptor A2a
LigandBDBM50097431
Substrate/Competitorn/a
Meas. Tech.ChEBML_30141
Ki 1900±n/a nM
Citation van Tilburg, EWvan der Klein, PAde Groote, MBeukers, MWIJzerman, AP Substituted 4-phenyl-2-(phenylcarboxamido)-1,3-thiazole derivatives as antagonists for the adenosine A(1) receptor. Bioorg Med Chem Lett11:2017-9 (2001) Adenosine receptor A2a
Name:Adenosine receptor A2a
Type:G Protein-Coupled Receptor (GPCR)
Mol. Mass.:45015.65
Organism:Rattus norvegicus (rat)
Description:Rat A2A receptors expressed in CHO cells.
Residue:410
BDBM50097431
NameBDBM50097431
Synonyms:4-Methoxy-N-(4-phenyl-thiazol-2-yl)-benzamide 4-methoxy-N-(4-phenylthiazol-2-yl)benzamide LUF-5433
TypeSmall organic molecule
Emp. Form.C17H14N2O2S
Mol. Mass.310.37
SMILESCOc1ccc(cc1)C(=O)Nc1nc(cs1)-c1ccccc1