Reaction Details
TargetProstaglandin E2 receptor EP3 subtype
LigandBDBM50101826
Substrate/Competitorn/a
Meas. Tech.ChEBML_158323
Ki>0.000100±n/a nM
Citation Tani, KNaganawa, AIshida, AEgashira, HSagawa, KHarada, HOgawa, MMaruyama, TOhuchida, SNakai, HKondo, KToda, M Design and synthesis of a highly selective EP2-receptor agonist. Bioorg Med Chem Lett11:2025-8 (2001) Prostaglandin E2 receptor EP3 subtype
Name:Prostaglandin E2 receptor EP3 subtype
Type:G-protein coupled receptor
Mol. Mass.:40092.50
Organism:Mus musculus (Mouse)
Description:n/a
Residue:365
BDBM50101826
NameBDBM50101826
Synonyms:(Z)-7-{(1R,2R,3R)-3-Hydroxy-2-[(E)-(S)-4-hydroxy-4-(1-isobutyl-cyclobutyl)-but-1-enyl]-5-oxo-cyclopentyl}-hept-5-enoic acid | CHEMBL304225
TypeSmall organic molecule
Emp. Form.C24H38O5
Mol. Mass.406.5555
SMILESCC(C)CC1(CCC1)[C@@H](O)C\C=C\[C@H]1[C@H](O)CC(=O)[C@@H]1C\C=C/CCCC(O)=O