Reaction Details
TargetProstaglandin E2 receptor EP2 subtype
LigandBDBM50101824
Substrate/Competitorn/a
Meas. Tech.ChEMBL_158306 (CHEMBL763191)
EC50 33±n/a nM
Citation Tani, KNaganawa, AIshida, AEgashira, HSagawa, KHarada, HOgawa, MMaruyama, TOhuchida, SNakai, HKondo, KToda, M Design and synthesis of a highly selective EP2-receptor agonist. Bioorg Med Chem Lett11:2025-8 (2001) Prostaglandin E2 receptor EP2 subtype
Name:Prostaglandin E2 receptor EP2 subtype
Type:G-protein coupled receptor
Mol. Mass.:40495.26
Organism:Mus musculus (Mouse)
Description:n/a
Residue:362
BDBM50101824
NameBDBM50101824
Synonyms:7-{(1R,3R)-3-Hydroxy-2-[(E)-(S)-4-hydroxy-4-(1-propyl-cyclobutyl)-but-1-enyl]-5-oxo-cyclopentyl}-heptanoic acid methyl ester Butaprost (Methyl Ester) | CHEMBL432522
TypeSmall organic molecule
Emp. Form.C24H40O5
Mol. Mass.408.5714
SMILESCCCC1(CCC1)[C@@H](O)C\C=C\C1[C@H](O)CC(=O)[C@@H]1CCCCCCC(=O)OC