Reaction Details
TargetProstaglandin E2 receptor EP2 subtype
LigandBDBM50101827
Substrate/Competitorn/a
Meas. Tech.ChEBML_158309
Ki 30±n/a nM
Citation Tani, KNaganawa, AIshida, AEgashira, HSagawa, KHarada, HOgawa, MMaruyama, TOhuchida, SNakai, HKondo, KToda, M Design and synthesis of a highly selective EP2-receptor agonist. Bioorg Med Chem Lett11:2025-8 (2001) Prostaglandin E2 receptor EP2 subtype
Name:Prostaglandin E2 receptor EP2 subtype
Type:G-protein coupled receptor
Mol. Mass.:40495.26
Organism:Mus musculus (Mouse)
Description:n/a
Residue:362
BDBM50101827
NameBDBM50101827
Synonyms:(Z)-7-{(1R,2R,3R)-2-[(E)-(S)-4-(1-Ethyl-cyclobutyl)-4-hydroxy-but-1-enyl]-3-hydroxy-5-oxo-cyclopentyl}-hept-5-enoic acid | CHEMBL64483
TypeSmall organic molecule
Emp. Form.C22H34O5
Mol. Mass.378.5024
SMILESCCC1(CCC1)[C@@H](O)C\C=C\[C@H]1[C@H](O)CC(=O)[C@@H]1C\C=C/CCCC(O)=O