Reaction Details
TargetProstaglandin E2 receptor EP4 subtype
LigandBDBM50101848
Substrate/Competitorn/a
Meas. Tech.ChEMBL_158450 (CHEMBL763254)
Ki 0.400000±n/a nM
Citation Maruyama, TAsada, MShiraishi, TIshida, AEgashira, HYoshida, HMaruyama, TOhuchida, SNakai, HKondo, KToda, M Design and synthesis of a highly selective EP4-receptor agonist. Part 1: 3,7-dithiaPG derivatives with high selectivity. Bioorg Med Chem Lett11:2029-31 (2001) Prostaglandin E2 receptor EP4 subtype
Name:Prostaglandin E2 receptor EP4 subtype
Type:G-protein coupled receptor
Mol. Mass.:56175.66
Organism:Mus musculus (Mouse)
Description:n/a
Residue:513
BDBM50101848
NameBDBM50101848
Synonyms:6-[(1R,2S,3R)-3-Hydroxy-2-((E)-(3S,5S)-3-hydroxy-5-methyl-non-1-enyl)-5-oxo-cyclopentylsulfanyl]-hexanoic acid | CHEMBL64854
TypeSmall organic molecule
Emp. Form.C21H36O5S
Mol. Mass.400.573
SMILESCCCC[C@H](C)C[C@H](O)\C=C\[C@H]1[C@H](O)CC(=O)[C@@H]1SCCCCCC(O)=O