Reaction Details
TargetEstrogen receptor
LigandBDBM17292
Substrate/Competitorn/a
Meas. Tech.ChEMBL_1993610 (CHEMBL4627505)
IC50 0.720000±n/a nM
Citation Liu, XSuyama, KShiki, JTorikai, KNose, TShimohigashi, MShimohigashi, Y Bisphenol AF: Halogen bonding effect is a major driving force for the dual ER?-agonist and ER?-antagonist activities. Bioorg Med Chem28:0 (2020) 
 
Estrogen receptor
Name:Estrogen receptor
Type:Protein
Mol. Mass.:66230.44
Organism:Homo sapiens (Human)
Description:P03372
Residue:595
BDBM17292
NameBDBM17292
Synonyms:(1S,10R,11S,14S,15S)-15-methyltetracyclo[8.7.0.0^{2,7}.0^{11,15}]heptadeca-2,4,6-triene-5,14-diol 17α-ethinylestradiol CHEMBL135 ESTRADIOL Ovocyclin US9040509, E2 US9561238, E2 [2,4,6,7-3H]-E2 [3H]]estradiol
TypeSteroid
Emp. Form.C18H24O2
Mol. Mass.272.382
SMILES[H][C@@]12CC[C@H](O)[C@@]1(C)CC[C@]1([H])c3ccc(O)cc3CC[C@@]21[H]