Reaction Details
TargetEstrogen receptor
LigandBDBM50102190
Substrate/Competitorn/a
Meas. Tech.ChEBML_67512
Ki 160±n/a nM
Citation Henke, BRDrewry, DHJones, SAStewart, ELWeaver, SLWiethe, RW 2-Amino-4,6-diarylpyridines as novel ligands for the estrogen receptor. Bioorg Med Chem Lett11:1939-42 (2001) Estrogen receptor
Name:Estrogen receptor
Type:Protein
Mol. Mass.:66230.44
Organism:Homo sapiens (Human)
Description:P03372
Residue:595
BDBM50102190
NameBDBM50102190
Synonyms:2-Methyl-4-[6-(methyl-phenethyl-amino)-4-phenyl-pyridin-2-yl]-phenol | CHEMBL58563
TypeSmall organic molecule
Emp. Form.C27H26N2O
Mol. Mass.394.5081
SMILESCN(CCc1ccccc1)c1cc(cc(n1)-c1ccc(O)c(C)c1)-c1ccccc1