Reaction Details
TargetEstrogen receptor beta
LigandBDBM50102200
Substrate/Competitorn/a
Meas. Tech.ChEBML_67823
Ki 790±n/a nM
Citation Henke, BRDrewry, DHJones, SAStewart, ELWeaver, SLWiethe, RW 2-Amino-4,6-diarylpyridines as novel ligands for the estrogen receptor. Bioorg Med Chem Lett11:1939-42 (2001) Estrogen receptor beta
Name:Estrogen receptor beta
Type:Protein
Mol. Mass.:59238.43
Organism:Homo sapiens (Human)
Description:Q92731
Residue:530
BDBM50102200
NameBDBM50102200
Synonyms:4-[6-(Butyl-methyl-amino)-4-phenyl-pyridin-2-yl]-2-methyl-phenol | CHEMBL58504
TypeSmall organic molecule
Emp. Form.C23H26N2O
Mol. Mass.346.4653
SMILESCCCCN(C)c1cc(cc(n1)-c1ccc(O)c(C)c1)-c1ccccc1