Reaction Details
TargetEstrogen receptor
LigandBDBM50102198
Substrate/Competitorn/a
Meas. Tech.ChEBML_67512
Ki 2000±n/a nM
Citation Henke, BRDrewry, DHJones, SAStewart, ELWeaver, SLWiethe, RW 2-Amino-4,6-diarylpyridines as novel ligands for the estrogen receptor. Bioorg Med Chem Lett11:1939-42 (2001) Estrogen receptor
Name:Estrogen receptor
Type:Protein
Mol. Mass.:66230.44
Organism:Homo sapiens (Human)
Description:P03372
Residue:595
BDBM50102198
NameBDBM50102198
Synonyms:4-{6-[Bis-(2-ethoxy-ethyl)-amino]-4-phenyl-pyridin-2-yl}-2-methyl-phenol | CHEMBL60909
TypeSmall organic molecule
Emp. Form.C26H32N2O3
Mol. Mass.420.5439
SMILESCCOCCN(CCOCC)c1cc(cc(n1)-c1ccc(O)c(C)c1)-c1ccccc1