Reaction Details
TargetEstrogen receptor
LigandBDBM50102202
Substrate/Competitorn/a
Meas. Tech.ChEBML_67512
Ki 650±n/a nM
Citation Henke, BRDrewry, DHJones, SAStewart, ELWeaver, SLWiethe, RW 2-Amino-4,6-diarylpyridines as novel ligands for the estrogen receptor. Bioorg Med Chem Lett11:1939-42 (2001) Estrogen receptor
Name:Estrogen receptor
Type:Protein
Mol. Mass.:66230.44
Organism:Homo sapiens (Human)
Description:P03372
Residue:595
BDBM50102202
NameBDBM50102202
Synonyms:4-[6-(Methyl-phenethyl-amino)-4-o-tolyl-pyridin-2-yl]-phenol | CHEMBL294710
TypeSmall organic molecule
Emp. Form.C27H26N2O
Mol. Mass.394.5081
SMILESCN(CCc1ccccc1)c1cc(cc(n1)-c1ccc(O)cc1)-c1ccccc1C