Reaction Details
TargetEstrogen receptor beta
LigandBDBM50102204
Substrate/Competitorn/a
Meas. Tech.ChEBML_67823
Ki 330±n/a nM
Citation Henke, BRDrewry, DHJones, SAStewart, ELWeaver, SLWiethe, RW 2-Amino-4,6-diarylpyridines as novel ligands for the estrogen receptor. Bioorg Med Chem Lett11:1939-42 (2001) Estrogen receptor beta
Name:Estrogen receptor beta
Type:Protein
Mol. Mass.:59238.43
Organism:Homo sapiens (Human)
Description:Q92731
Residue:530
BDBM50102204
NameBDBM50102204
Synonyms:2-Methyl-4-[4-phenyl-6-(propyl-pyridin-2-ylmethyl-amino)-pyridin-2-yl]-phenol | CHEMBL57093
TypeSmall organic molecule
Emp. Form.C27H27N3O
Mol. Mass.409.5228
SMILESCCCN(Cc1ccccn1)c1cc(cc(n1)-c1ccc(O)c(C)c1)-c1ccccc1