Reaction Details
TargetP2X purinoceptor 2
LigandBDBM50064800
Substrate/Competitorn/a
Meas. Tech.ChEMBL_147550 (CHEMBL754947)
IC50 398±n/a nM
Citation Kim, YCBrown, SGHarden, TKBoyer, JLDubyak, GKing, BFBurnstock, GJacobson, KA Structure-activity relationships of pyridoxal phosphate derivatives as potent and selective antagonists of P2X1 receptors. J Med Chem44:340-9 (2001) P2X purinoceptor 2
Name:P2X purinoceptor 2
Type:Enzyme Catalytic Domain
Mol. Mass.:52625.55
Organism:RAT
Description:Purinergic, P2X2 0 RAT::P49653
Residue:472
BDBM50064800
NameBDBM50064800
Synonyms:2-(4-Formyl-5-hydroxy-6-methyl-3-phosphonooxymethyl-pyridin-2-ylazo)-benzene-1,4-disulfonic acid isoPPADS | pyridoxal-alpha5-phosphate-6-azophenyl-2',5'-disulfonic acid
TypeSmall organic molecule
Emp. Form.C14H14N3O12PS2
Mol. Mass.511.378
SMILESCc1nc(N=Nc2cc(ccc2S(O)(=O)=O)S(O)(=O)=O)c(COP(O)(O)=O)c(C=O)c1O