Reaction Details
TargetP2X purinoceptor 3
LigandBDBM50102295
Substrate/Competitorn/a
Meas. Tech.ChEMBL_147552 (CHEMBL751122)
IC50 140±n/a nM
Citation Kim, YCBrown, SGHarden, TKBoyer, JLDubyak, GKing, BFBurnstock, GJacobson, KA Structure-activity relationships of pyridoxal phosphate derivatives as potent and selective antagonists of P2X1 receptors. J Med Chem44:340-9 (2001) P2X purinoceptor 3
Name:P2X purinoceptor 3
Type:Enzyme Catalytic Domain
Mol. Mass.:44397.63
Organism:RAT
Description:Purinergic, P2X3 0 RAT::P49654
Residue:397
BDBM50102295
NameBDBM50102295
Synonyms:4-(4-Formyl-5-hydroxy-6-methyl-3-phosphonooxymethyl-pyridin-2-ylazo)-benzoic acid | CHEMBL119235
TypeSmall organic molecule
Emp. Form.C15H14N3O8P
Mol. Mass.395.2607
SMILESCc1nc(N=Nc2ccc(cc2)C(O)=O)c(COP(O)(O)=O)c(C=O)c1O