Reaction Details
TargetP2X purinoceptor 2
LigandBDBM50102298
Substrate/Competitorn/a
Meas. Tech.ChEMBL_147550 (CHEMBL754947)
IC50 150±n/a nM
Citation Kim, YCBrown, SGHarden, TKBoyer, JLDubyak, GKing, BFBurnstock, GJacobson, KA Structure-activity relationships of pyridoxal phosphate derivatives as potent and selective antagonists of P2X1 receptors. J Med Chem44:340-9 (2001) P2X purinoceptor 2
Name:P2X purinoceptor 2
Type:Enzyme Catalytic Domain
Mol. Mass.:52625.55
Organism:RAT
Description:Purinergic, P2X2 0 RAT::P49653
Residue:472
BDBM50102298
NameBDBM50102298
Synonyms:4-(4-Formyl-5-hydroxy-6-methyl-3-phosphonomethyl-pyridin-2-ylazo)-benzoic acid | CHEMBL119180
TypeSmall organic molecule
Emp. Form.C15H14N3O7P
Mol. Mass.379.2613
SMILESCc1nc(N=Nc2ccc(cc2)C(O)=O)c(CP(O)(O)=O)c(C=O)c1O