Reaction Details
TargetAdenosine receptor A2a
LigandBDBM50094691
Substrate/Competitorn/a
Meas. Tech.ChEMBL_31495 (CHEMBL647480)
Ki 1390±n/a nM
Citation Baraldi, PGCacciari, BMoro, SRomagnoli, RJi Xd, naJacobson, KAGessi, SBorea, PASpalluto, G Fluorosulfonyl- and bis-(beta-chloroethyl)amino-phenylamino functionalized pyrazolo[4,3-e]1,2,4-triazolo[1,5-c]pyrimidine derivatives: irreversible antagonists at the human A3 adenosine receptor and molecular modeling studies. J Med Chem44:2735-42 (2001) Adenosine receptor A2a
Name:Adenosine receptor A2a
Type:G Protein-Coupled Receptor (GPCR)
Mol. Mass.:44716.46
Organism:Homo sapiens (Human)
Description:P29274
Residue:412
BDBM50094691
NameBDBM50094691
Synonyms:1-(2-(furan-2-yl)-8-methyl-8H-pyrazolo[4,3-e][1,2,4]triazolo[1,5-c]pyrimidin-5-yl)-3-(4-methoxyphenyl)urea CHEMBL329791
TypeSmall organic molecule
Emp. Form.C19H16N8O3
Mol. Mass.404.3821
SMILESCOc1ccc(NC(=O)Nc2nc3nn(C)cc3c3nc(nn23)-c2ccco2)cc1