Reaction Details
TargetOxytocin receptor
LigandBDBM50103475
Substrate/Competitorn/a
Meas. Tech.ChEMBL_145034 (CHEMBL753728)
Ki 0.3±n/a nM
Citation Carnazzi, EAumelas, AMouillac, BBreton, CGuillou, LBarberis, CSeyer, R Design, synthesis and pharmacological characterization of a potent radioiodinated and photoactivatable peptidic oxytocin antagonist. J Med Chem44:3022-30 (2001) Oxytocin receptor
Name:Oxytocin receptor
Type:Enzyme Catalytic Domain
Mol. Mass.:42793.26
Organism:Homo sapiens (Human)
Description:Oxytocin OXTR HEK293::B2R9L7
Residue:389
BDBM50103475
NameBDBM50103475
Synonyms:Pmp-Tyr-Ile-Thr-Asn-Cys-Pro-Orn-phe(I,N3)-NH2 | Pmp-Tyr-Ile-Thr-Asn-Cys-Pro-Orn-phe(I125,N3)-NH2
TypeSmall organic molecule
Emp. Form.C57H84IN15O13S2
Mol. Mass.1378.404
SMILESCC[C@H](C)[C@H](NC(=O)[C@H](Cc1ccc(OC)cc1)NC(=O)CC1(CCCCC1)SCCC(N)=O)C(=O)N[C@@H]([C@@H](C)O)C(=O)N[C@@H](CC(N)=O)C(=O)N[C@@H](CS)C(=O)N1CCCC1C(=O)NC(CCCN)C(=O)NC(Cc1ccc(N=[N+]=[N-])c(I)c1)C(N)=O