Reaction Details
TargetD(2) dopamine receptor
LigandBDBM50103830
Substrate/Competitorn/a
Meas. Tech.ChEBML_61118
Ki 0.930000±n/a nM
Citation Feenstra, RWde Moes, JHofma, JJKling, HKuipers, WLong, SKTulp, MTvan der Heyden, JAKruse, CG New 1-aryl-4-(biarylmethylene)piperazines as potential atypical antipsychotics sharing dopamine D(2)-receptor and serotonin 5-HT(1A)-receptor affinities. Bioorg Med Chem Lett11:2345-9 (2001) D(2) dopamine receptor
Name:D(2) dopamine receptor
Type:Cell-surface receptors
Mol. Mass.:50647.10
Organism:Homo sapiens (Human)
Description:P14416
Residue:443
BDBM50103830
NameBDBM50103830
Synonyms:8-(4-Biphenyl-3-ylmethyl-piperazin-1-yl)-3,4-dihydro-2H-benzo[1,4]oxazine | CHEMBL310048
TypeSmall organic molecule
Emp. Form.C25H27N3O
Mol. Mass.385.5014
SMILESC(N1CCN(CC1)c1cccc2NCCOc12)c1cccc(c1)-c1ccccc1