Reaction Details
TargetP2Y purinoceptor 1
LigandBDBM50104015
Substrate/Competitorn/a
Meas. Tech.ChEMBL_147893 (CHEMBL759293)
IC50 7860±n/a nM
Citation Kim, HSBarak, DHarden, TKBoyer, JLJacobson, KA Acyclic and cyclopropyl analogues of adenosine bisphosphate antagonists of the P2Y1 receptor: structure-activity relationships and receptor docking. J Med Chem44:3092-108 (2001) P2Y purinoceptor 1
Name:P2Y purinoceptor 1
Type:n/a
Mol. Mass.:41199.64
Organism:Meleagris gallopavo
Description:n/a
Residue:362
BDBM50104015
NameBDBM50104015
Synonyms:CHEMBL104143 | Phosphoric acid mono-[3-(2-chloro-6-methylamino-purin-9-yl)-2-phosphonooxy-propyl] ester
TypeSmall organic molecule
Emp. Form.C9H14ClN5O8P2
Mol. Mass.417.637
SMILESCNc1nc(Cl)nc2n(C[C@H](COP(O)(O)=O)OP(O)(O)=O)cnc12