Reaction Details
TargetP2Y purinoceptor 1
LigandBDBM50104027
Substrate/Competitorn/a
Meas. Tech.ChEMBL_147893 (CHEMBL759293)
IC50 37600±n/a nM
Citation Kim, HSBarak, DHarden, TKBoyer, JLJacobson, KA Acyclic and cyclopropyl analogues of adenosine bisphosphate antagonists of the P2Y1 receptor: structure-activity relationships and receptor docking. J Med Chem44:3092-108 (2001) P2Y purinoceptor 1
Name:P2Y purinoceptor 1
Type:n/a
Mol. Mass.:41199.64
Organism:Meleagris gallopavo
Description:n/a
Residue:362
BDBM50104027
NameBDBM50104027
Synonyms:Acetic acid 3-(2-chloro-6-methylamino-purin-9-yl)-2-phosphonomethyl-propyl ester CHEMBL320073
TypeSmall organic molecule
Emp. Form.C12H17ClN5O6P
Mol. Mass.393.72
SMILESCNc1nc(Cl)nc2n(CC(COC(C)=O)COP(O)(O)=O)cnc12