Reaction Details
TargetP2Y purinoceptor 1
LigandBDBM50085328
Substrate/Competitorn/a
Meas. Tech.ChEMBL_147893 (CHEMBL759293)
IC50 1600±n/a nM
Citation Kim, HSBarak, DHarden, TKBoyer, JLJacobson, KA Acyclic and cyclopropyl analogues of adenosine bisphosphate antagonists of the P2Y1 receptor: structure-activity relationships and receptor docking. J Med Chem44:3092-108 (2001) P2Y purinoceptor 1
Name:P2Y purinoceptor 1
Type:n/a
Mol. Mass.:41199.64
Organism:Meleagris gallopavo
Description:n/a
Residue:362
BDBM50085328
NameBDBM50085328
Synonyms:CHEMBL432028 | Phosphoric acid mono-[4-(6-methylamino-purin-9-yl)-2-phosphonooxymethyl-butyl] ester
TypeSmall organic molecule
Emp. Form.C11H19N5O8P2
Mol. Mass.411.2448
SMILESCNc1ncnc2n(CCC(COP(O)(O)=O)COP(O)(O)=O)cnc12