Reaction Details
TargetP2Y purinoceptor 1
LigandBDBM50104020
Substrate/Competitorn/a
Meas. Tech.ChEMBL_147893 (CHEMBL759293)
IC50 22600±n/a nM
Citation Kim, HSBarak, DHarden, TKBoyer, JLJacobson, KA Acyclic and cyclopropyl analogues of adenosine bisphosphate antagonists of the P2Y1 receptor: structure-activity relationships and receptor docking. J Med Chem44:3092-108 (2001) P2Y purinoceptor 1
Name:P2Y purinoceptor 1
Type:n/a
Mol. Mass.:41199.64
Organism:Meleagris gallopavo
Description:n/a
Residue:362
BDBM50104020
NameBDBM50104020
Synonyms:CHEMBL107952 | Phosphoric acid mono-[3-(2-chloro-6-methylamino-purin-9-yl)-2-hydroxymethyl-propyl] ester
TypeSmall organic molecule
Emp. Form.C10H15ClN5O5P
Mol. Mass.351.683
SMILESCNc1nc(Cl)nc2n(CC(CO)COP(O)(O)=O)cnc12