Reaction Details
TargetP2Y purinoceptor 1
LigandBDBM50104025
Substrate/Competitorn/a
Meas. Tech.ChEMBL_147893 (CHEMBL759293)
IC50 31000±n/a nM
Citation Kim, HSBarak, DHarden, TKBoyer, JLJacobson, KA Acyclic and cyclopropyl analogues of adenosine bisphosphate antagonists of the P2Y1 receptor: structure-activity relationships and receptor docking. J Med Chem44:3092-108 (2001) P2Y purinoceptor 1
Name:P2Y purinoceptor 1
Type:n/a
Mol. Mass.:41199.64
Organism:Meleagris gallopavo
Description:n/a
Residue:362
BDBM50104025
NameBDBM50104025
Synonyms:CHEMBL432590 | Phosphoric acid 3-(2-chloro-6-methylamino-purin-9-yl)-2-phosphonooxymethyl-propyl ester dimethyl ester
TypeSmall organic molecule
Emp. Form.C12H20ClN5O8P2
Mol. Mass.459.716
SMILESCNc1nc(Cl)nc2n(CC(COP(O)(O)=O)COP(=O)(OC)OC)cnc12