Reaction Details
TargetP2Y purinoceptor 1
LigandBDBM50104026
Substrate/Competitorn/a
Meas. Tech.ChEMBL_147893 (CHEMBL759293)
IC50 1090±n/a nM
Citation Kim, HSBarak, DHarden, TKBoyer, JLJacobson, KA Acyclic and cyclopropyl analogues of adenosine bisphosphate antagonists of the P2Y1 receptor: structure-activity relationships and receptor docking. J Med Chem44:3092-108 (2001) P2Y purinoceptor 1
Name:P2Y purinoceptor 1
Type:n/a
Mol. Mass.:41199.64
Organism:Meleagris gallopavo
Description:n/a
Residue:362
BDBM50104026
NameBDBM50104026
Synonyms:CHEMBL320924 | Phosphoric acid mono-[3-(6-methylamino-purin-9-yl)-2-phosphonooxymethyl-propyl] ester
TypeSmall organic molecule
Emp. Form.C10H17N5O8P2
Mol. Mass.397.2182
SMILESCNc1ncnc2n(CC(COP(O)(O)=O)COP(O)(O)=O)cnc12