Reaction Details
TargetTyrosine-protein kinase JAK1
LigandBDBM50193995
Substrate/Competitorn/a
Meas. Tech.ChEMBL_2013351 (CHEMBL4666929)
Ki 0.640000±n/a nM
Citation Zak, MHanan, EJLupardus, PBrown, DGRobinson, CSiu, MLyssikatos, JPRomero, FAZhao, GKellar, TMendonca, RRay, NCGoodacre, SCCrackett, PHMcLean, NHurley, CAYuen, PWCheng, YXLiu, XLiimatta, MKohli, PBNonomiya, JSalmon, GBuckley, GLloyd, JGibbons, PGhilardi, NKenny, JRJohnson, A Discovery of a class of highly potent Janus Kinase 1/2 (JAK1/2) inhibitors demonstrating effective cell-based blockade of IL-13 signaling. Bioorg Med Chem Lett29:1522-1531 (2019) 
 
Tyrosine-protein kinase JAK1
Name:Tyrosine-protein kinase JAK1
Type:Protein
Mol. Mass.:133293.73
Organism:Homo sapiens (Human)
Description:P23458
Residue:1154
BDBM50193995
NameBDBM50193995
Synonyms:3-((3R,4R)-4-methyl-3-(methyl(7H-pyrrolo[2,3-d]pyrimidin-4-yl)amino)piperidin-1-yl)-3-oxopropanenitrile 3-{(3R,4R)-4-methyl-3-[methyl(7H-pyrrolo[2,3-d]pyrimidin-4-yl)amino]piperidin-1-yl}-3-oxopropanenitrile CP-690550 Tofacitinib US10112907, Example 00035 US10766894, Compound TABLE 1.20 US11078206, Example Tofacitinib US11339167, Example Tofacitinib
TypeSmall organic molecule
Emp. Form.C16H20N6O
Mol. Mass.312.3696
SMILESC[C@@H]1CCN(C[C@@H]1N(C)c1ncnc2[nH]ccc12)C(=O)CC#N