Reaction Details
TargetEstrogen receptor beta
LigandBDBM50104326
Substrate/Competitorn/a
Meas. Tech.ChEBML_67826
Ki 0.060000±n/a nM
Citation Mortensen, DSRodriguez, ALSun, JKatzenellenbogen, BSKatzenellenbogen, JA Furans with basic side chains: synthesis and biological evaluation of a novel series of antagonists with selectivity for the estrogen receptor alpha. Bioorg Med Chem Lett11:2521-4 (2001) Estrogen receptor beta
Name:Estrogen receptor beta
Type:Protein
Mol. Mass.:59238.43
Organism:Homo sapiens (Human)
Description:Q92731
Residue:530
BDBM50104326
NameBDBM50104326
Synonyms:4-{3-(4-hydroxy-phenyl)-4-ethyl-5-[4-(2-piperidin-1-yl-ethoxy)-phenyl]-furan-2-yl}-phenol | CHEMBL315474
TypeSmall organic molecule
Emp. Form.C31H33NO4
Mol. Mass.483.598
SMILESCCc1c(oc(c1-c1ccc(O)cc1)-c1ccc(O)cc1)-c1ccc(OCCN2CCCCC2)cc1