Reaction Details
TargetAdenosine receptor A1
LigandBDBM50104334
Substrate/Competitorn/a
Meas. Tech.ChEBML_29103
Ki 50±n/a nM
Citation Schenone, SBruno, OFossa, PRanise, AMenozzi, GMosti, LBondavalli, FMartini, CTrincavelli, L Synthesis and biological data of 4-amino-1-(2-chloro-2-phenylethyl)-1H-pyrazolo[3,4-b]pyridine-5-carboxylic acid ethyl esters, a new series of A1-adenosine receptor (A1AR) ligands. Bioorg Med Chem Lett11:2529-31 (2001) Adenosine receptor A1
Name:Adenosine receptor A1
Type:Enzyme Catalytic Domain
Mol. Mass.:36602.99
Organism:BOVINE
Description:ADENOSINE 0 BOVINE::P28190
Residue:326
BDBM50104334
NameBDBM50104334
Synonyms:1-(2-Chloro-2-phenyl-ethyl)-4-phenethylamino-1H-pyrazolo[3,4-b]pyridine-5-carboxylic acid ethyl ester ethyl 1-(2-chloro-2-phenylethyl)-4-(phenethylamino)-1H-pyrazolo[3,4-b]pyridine-5-carboxylate
TypeSmall organic molecule
Emp. Form.C25H25ClN4O2
Mol. Mass.448.945
SMILESCCOC(=O)c1cnc2n(CC(Cl)c3ccccc3)ncc2c1NCCc1ccccc1