Reaction Details
TargetActivin receptor type-1
LigandBDBM50524284
Substrate/Competitorn/a
Meas. Tech.ChEMBL_2014129 (CHEMBL4667707)
Kd 1000±n/a nM
Citation Asquith, CRMTreiber, DKZuercher, WJ Utilizing comprehensive and mini-kinome panels to optimize the selectivity of quinoline inhibitors for cyclin G associated kinase (GAK). Bioorg Med Chem Lett29:1727-1731 (2019) 
 
Activin receptor type-1
Name:Activin receptor type-1
Type:n/a
Mol. Mass.:57158.32
Organism:Homo sapiens (Human)
Description:n/a
Residue:509
BDBM50524284
NameBDBM50524284
Synonyms:CHEMBL4443342
TypeSmall organic molecule
Emp. Form.C18H17BrN2O3
Mol. Mass.389.243
SMILESCOc1cc(Nc2ccnc3ccc(Br)cc23)cc(OC)c1OC