Reaction Details
TargetEphrin type-A receptor 8
LigandBDBM6511
Substrate/Competitorn/a
Meas. Tech.ChEMBL_2014133 (CHEMBL4667711)
Kd 560±n/a nM
Citation Asquith, CRMTreiber, DKZuercher, WJ Utilizing comprehensive and mini-kinome panels to optimize the selectivity of quinoline inhibitors for cyclin G associated kinase (GAK). Bioorg Med Chem Lett29:1727-1731 (2019) 
 
Ephrin type-A receptor 8
Name:Ephrin type-A receptor 8
Type:PROTEIN
Mol. Mass.:111022.09
Organism:Homo sapiens (Human)
Description:ChEMBL_774600
Residue:1005
BDBM6511
NameBDBM6511
Synonyms:4-Anilinoquinoline deriv. 8 | 6,7-dimethoxy-N-(3,4,5-trimethoxyphenyl)quinolin-4-amine
TypeSmall organic molecule
Emp. Form.C20H22N2O5
Mol. Mass.370.3991
SMILESCOc1cc(Nc2ccnc3cc(OC)c(OC)cc23)cc(OC)c1OC