Reaction Details
TargetTelomerase reverse transcriptase
LigandBDBM50104469
Substrate/Competitorn/a
Meas. Tech.ChEBML_210074
IC50 15100±n/a nM
Citation Sasaki, SEhara, TAlam, MRFujino, YHarada, NKimura, JNakamura, HMaeda, M Solid-Phase synthesis of a library constructed of aromatic phosphate, long alkyl chains and tryptophane components, and identification of potent dipeptide telomerase inhibitors. Bioorg Med Chem Lett11:2581-4 (2001) Telomerase reverse transcriptase
Name:Telomerase reverse transcriptase
Type:PROTEIN
Mol. Mass.:127099.03
Organism:Homo sapiens (Human)
Description:ChEMBL_1447029
Residue:1132
BDBM50104469
NameBDBM50104469
Synonyms:CHEMBL85749 | Phosphoric acid 12-[(S)-2-amino-3-(1H-indol-3-yl)-propionylamino]-dodecyl ester 2-chloro-phenyl ester; compound with triethyl-amine
TypeSmall organic molecule
Emp. Form.C29H41ClN3O5P
Mol. Mass.578.08
SMILESN[C@@H](Cc1c[nH]c2ccccc12)C(=O)NCCCCCCCCCCCCOP(O)(=O)Oc1ccccc1Cl