Reaction Details
TargetTelomerase reverse transcriptase
LigandBDBM50104475
Substrate/Competitorn/a
Meas. Tech.ChEBML_210074
IC50 3600±n/a nM
Citation Sasaki, SEhara, TAlam, MRFujino, YHarada, NKimura, JNakamura, HMaeda, M Solid-Phase synthesis of a library constructed of aromatic phosphate, long alkyl chains and tryptophane components, and identification of potent dipeptide telomerase inhibitors. Bioorg Med Chem Lett11:2581-4 (2001) Telomerase reverse transcriptase
Name:Telomerase reverse transcriptase
Type:PROTEIN
Mol. Mass.:127099.03
Organism:Homo sapiens (Human)
Description:ChEMBL_1447029
Residue:1132
BDBM50104475
NameBDBM50104475
Synonyms:CHEMBL83388 | Phosphoric acid 2-chloro-phenyl ester 12-(2-{1-[3-(3-methyl-indol-1-yl)-propyl]-1H-indol-3-yl}-acetylamino)-dodecyl ester; compound with triethyl-amine
TypeSmall organic molecule
Emp. Form.C40H51ClN3O5P
Mol. Mass.720.277
SMILESCc1cn(CCCn2cc(CC(=O)NCCCCCCCCCCCCOP(O)(=O)Oc3ccccc3Cl)c3ccccc23)c2ccccc12