Reaction Details
TargetTelomerase reverse transcriptase
LigandBDBM50104483
Substrate/Competitorn/a
Meas. Tech.ChEBML_210074
IC50 29400±n/a nM
Citation Sasaki, SEhara, TAlam, MRFujino, YHarada, NKimura, JNakamura, HMaeda, M Solid-Phase synthesis of a library constructed of aromatic phosphate, long alkyl chains and tryptophane components, and identification of potent dipeptide telomerase inhibitors. Bioorg Med Chem Lett11:2581-4 (2001) Telomerase reverse transcriptase
Name:Telomerase reverse transcriptase
Type:PROTEIN
Mol. Mass.:127099.03
Organism:Homo sapiens (Human)
Description:ChEMBL_1447029
Residue:1132
BDBM50104483
NameBDBM50104483
Synonyms:CHEMBL313009 | Phosphoric acid 2-chloro-phenyl ester 6-(2-{1-[3-(3-methyl-indol-1-yl)-propyl]-1H-indol-3-yl}-acetylamino)-hexyl ester; compound with triethyl-amine
TypeSmall organic molecule
Emp. Form.C34H39ClN3O5P
Mol. Mass.636.117
SMILESCc1cn(CCCn2cc(CC(=O)NCCCCCCOP(O)(=O)Oc3ccccc3Cl)c3ccccc23)c2ccccc12