Reaction Details
TargetTelomerase reverse transcriptase
LigandBDBM50104490
Substrate/Competitorn/a
Meas. Tech.ChEBML_210074
IC50 3600±n/a nM
Citation Sasaki, SEhara, TAlam, MRFujino, YHarada, NKimura, JNakamura, HMaeda, M Solid-Phase synthesis of a library constructed of aromatic phosphate, long alkyl chains and tryptophane components, and identification of potent dipeptide telomerase inhibitors. Bioorg Med Chem Lett11:2581-4 (2001) Telomerase reverse transcriptase
Name:Telomerase reverse transcriptase
Type:PROTEIN
Mol. Mass.:127099.03
Organism:Homo sapiens (Human)
Description:ChEMBL_1447029
Residue:1132
BDBM50104490
NameBDBM50104490
Synonyms:CHEMBL314864 | [(R)-1-{12-[(2-Chloro-phenoxy)-hydroxy-phosphoryloxy]-dodecylcarbamoyl}-2-(1H-indol-3-yl)-ethyl]-carbamic acid benzyl ester; compound with triethyl-amine
TypeSmall organic molecule
Emp. Form.C37H47ClN3O7P
Mol. Mass.712.212
SMILESOP(=O)(OCCCCCCCCCCCCNC(=O)[C@@H](Cc1c[nH]c2ccccc12)NC(=O)OCc1ccccc1)Oc1ccccc1Cl