Reaction Details
TargetTelomerase reverse transcriptase
LigandBDBM50104499
Substrate/Competitorn/a
Meas. Tech.ChEBML_210074
IC50 29700±n/a nM
Citation Sasaki, SEhara, TAlam, MRFujino, YHarada, NKimura, JNakamura, HMaeda, M Solid-Phase synthesis of a library constructed of aromatic phosphate, long alkyl chains and tryptophane components, and identification of potent dipeptide telomerase inhibitors. Bioorg Med Chem Lett11:2581-4 (2001) Telomerase reverse transcriptase
Name:Telomerase reverse transcriptase
Type:PROTEIN
Mol. Mass.:127099.03
Organism:Homo sapiens (Human)
Description:ChEMBL_1447029
Residue:1132
BDBM50104499
NameBDBM50104499
Synonyms:CHEMBL313818 | Phosphoric acid 2-chloro-phenyl ester 12-(4-1H-indol-3-yl-butyrylamino)-dodecyl ester; compound with triethyl-amine
TypeSmall organic molecule
Emp. Form.C30H42ClN2O5P
Mol. Mass.577.092
SMILESOP(=O)(OCCCCCCCCCCCCNC(=O)CCCc1c[nH]c2ccccc12)Oc1ccccc1Cl