Reaction Details
TargetMacrophage metalloelastase
LigandBDBM92446
Substrate/Competitorn/a
Meas. Tech.ChEMBL_2014866 (CHEMBL4668444)
IC50 2.5±n/a nM
Citation Zipfel, PRochais, CBaranger, KRivera, SDallemagne, P Matrix Metalloproteinases as New Targets in Alzheimer's Disease: Opportunities and Challenges. J Med Chem63:10705-10725 (2020) 
 
Macrophage metalloelastase
Name:Macrophage metalloelastase
Type:Enzyme
Mol. Mass.:54012.99
Organism:Homo sapiens (Human)
Description:P39900
Residue:470
BDBM92446
NameBDBM92446
Synonyms:Inhibitor, 16
TypeSmall organic molecule
Emp. Form.C22H20N2O4S
Mol. Mass.408.47
SMILESNC(=O)[C@H](CCC(O)=O)NC(=O)c1ccc(cc1)-c1cc(cs1)-c1ccccc1