Reaction Details
Target5-hydroxytryptamine receptor 2A
LigandBDBM50104828
Substrate/Competitorn/a
Meas. Tech.ChEMBL_2618 (CHEMBL621530)
Ki 18±n/a nM
Citation Rangisetty, JBDukat, MDowd, CSHerrick-Davis, KDuPre, AGadepalli, STeitler, MKelley, CRSharif, NAGlennon, RA 1-[2-methoxy-5-(3-phenylpropyl)]-2-aminopropane unexpectedly shows 5-HT(2A) serotonin receptor affinity and antagonist character. J Med Chem44:3283-91 (2001) 5-hydroxytryptamine receptor 2A
Name:5-hydroxytryptamine receptor 2A
Type:G Protein-Coupled Receptor (GPCR)
Mol. Mass.:52852.05
Organism:Rattus norvegicus (rat)
Description:Rat cortex membranes 5-HT2A receptors.
Residue:471
BDBM50104828
NameBDBM50104828
Synonyms:2-[2-Methoxy-4-(5-phenyl-pentyl)-phenyl]-ethylamine | CHEMBL109589
TypeSmall organic molecule
Emp. Form.C20H27NO
Mol. Mass.297.4345
SMILESCOc1cc(CCCCCc2ccccc2)ccc1CCN