Reaction Details
Target5-hydroxytryptamine receptor 2A
LigandBDBM50104818
Substrate/Competitorn/a
Meas. Tech.ChEMBL_2619 (CHEMBL621531)
Ki 20±n/a nM
Citation Rangisetty, JBDukat, MDowd, CSHerrick-Davis, KDuPre, AGadepalli, STeitler, MKelley, CRSharif, NAGlennon, RA 1-[2-methoxy-5-(3-phenylpropyl)]-2-aminopropane unexpectedly shows 5-HT(2A) serotonin receptor affinity and antagonist character. J Med Chem44:3283-91 (2001) 5-hydroxytryptamine receptor 2A
Name:5-hydroxytryptamine receptor 2A
Type:G Protein-Coupled Receptor (GPCR)
Mol. Mass.:52852.05
Organism:Rattus norvegicus (rat)
Description:Rat cortex membranes 5-HT2A receptors.
Residue:471
BDBM50104818
NameBDBM50104818
Synonyms:2-[2-Methoxy-5-(3-phenyl-propyl)-phenyl]-ethylamine | CHEMBL326565
TypeSmall organic molecule
Emp. Form.C18H23NO
Mol. Mass.269.3813
SMILESCOc1ccc(CCCc2ccccc2)cc1CCN