Reaction Details
TargetAldehyde dehydrogenase, mitochondrial
LigandBDBM50093531
Substrate/Competitorn/a
Meas. Tech.ChEMBL_31176 (CHEMBL641141)
IC50 60±n/a nM
Citation Gao, GYLi, DJKeung, WM Synthesis of potential antidipsotropic isoflavones: inhibitors of the mitochondrial monoamine oxidase-aldehyde dehydrogenase pathway. J Med Chem44:3320-8 (2001) Aldehyde dehydrogenase, mitochondrial
Name:Aldehyde dehydrogenase, mitochondrial
Type:Enzyme
Mol. Mass.:56382.67
Organism:Homo sapiens (Human)
Description:P05091
Residue:517
BDBM50093531
NameBDBM50093531
Synonyms:6-[3-(4-Hydroxy-phenyl)-4-oxo-4H-chromen-7-yloxy]-hexanoic acid | CHEMBL113640
TypeSmall organic molecule
Emp. Form.C21H20O6
Mol. Mass.368.3799
SMILESOC(=O)CCCCCOc1ccc2c(c1)occ(-c1ccc(O)cc1)c2=O