Reaction Details
TargetAldehyde dehydrogenase, mitochondrial
LigandBDBM50104896
Substrate/Competitorn/a
Meas. Tech.ChEMBL_31176 (CHEMBL641141)
IC50 40±n/a nM
Citation Gao, GYLi, DJKeung, WM Synthesis of potential antidipsotropic isoflavones: inhibitors of the mitochondrial monoamine oxidase-aldehyde dehydrogenase pathway. J Med Chem44:3320-8 (2001) Aldehyde dehydrogenase, mitochondrial
Name:Aldehyde dehydrogenase, mitochondrial
Type:Enzyme
Mol. Mass.:56382.67
Organism:Homo sapiens (Human)
Description:P05091
Residue:517
BDBM50104896
NameBDBM50104896
Synonyms:7-(2-(2-(2-hydroxyethoxy)ethoxy)ethoxy)-3-(4-hydroxyphenyl)-4H-chromen-4-one CHEMBL114083
TypeSmall organic molecule
Emp. Form.C21H22O7
Mol. Mass.386.3952
SMILESOCCOCCOCCOc1ccc2c(c1)occ(-c1ccc(O)cc1)c2=O